January 18 - Friday Highlight is here, waiting for you to check it out!

How can I interpret the last exception file?

Comments

  • KenzieTinaKenzieTina Posts: 2 New Member
    @Bananas_45 for the cats & dog patch when i press run it said 1 fix & 1 unable to fix how can i know which 1 was unable to fix. i want to delete it?
  • Bananas_45Bananas_45 Posts: 4,538 Member
    KenzieTina wrote: »
    @Bananas_45 for the cats & dog patch when i press run it said 1 fix & 1 unable to fix how can i know which 1 was unable to fix. i want to delete it?

    Wow, I haven't had that happen before. @rosemow @_orangemittens_ do you have any advice?
  • rosemowrosemow Posts: 142,038 Member
    edited June 2018
    Bananas_45 wrote: »
    KenzieTina wrote: »
    @Bananas_45 for the cats & dog patch when i press run it said 1 fix & 1 unable to fix how can i know which 1 was unable to fix. i want to delete it?

    Wow, I haven't had that happen before. @rosemow @_orangemittens_ do you have any advice?

    Hello @KenzieTina
    The one file that was fixed would be the one that is contained in the back up folder. The file that wasn’t included in the back up folder would be the one that couldn’t be fixed, as nothing was done to that file.
  • Bananas_45Bananas_45 Posts: 4,538 Member
    Thanks @rosemow I will file that info away for myself. I knew that the fixed file would be backed up but, I didn't know if there was an archive for the files that aren't fixed.
  • rosemowrosemow Posts: 142,038 Member
    Bananas_45 wrote: »
    Thanks @rosemow I will file that info away for myself. I knew that the fixed file would be backed up but, I didn't know if there was an archive for the files that aren't fixed.

    You’re welcome :)
  • confusedsimmer2confusedsimmer2 Posts: 1 New Member
    hii, i was directed to you guys for help. i've been playing a save for over a year now and recently my sims have been disappearing. These sims were in my "played households" and all in houses. It tends to target my played households more, only a few townees have been disappearing. I keep getting last exceptions, below is part of one. if someone could help me i would appreciate it a ton.

    <?xml version="1.0" ?>
    2ce72f41bd3fec0545b21b101desyncea.maxis.sims4_64.15.pc2018-06-13 20:07:49Local.Unknown.Unknown.1.43.14.1020-1.200.000.339.Releaseappearance_modifier.py:226ce72f41bd3fec0545b21b101[manus] Sim 21397740777524833 failed to load (TypeError: Failed to parse argument.)
    Traceback (most recent call last):
    File "T:\InGame\Gameplay\Scripts\Server\areaserver.py", line 111, in wrapped
    File "T:\InGame\Gameplay\Scripts\Server\areaserver.py", line 107, in finally_wrap
    File "T:\InGame\Gameplay\Scripts\Core\sims4\utils.py", line 174, in wrapper
    File "T:\InGame\Gameplay\Scripts\Core\sims4\utils.py", line 192, in wrapper
    File "T:\InGame\Gameplay\Scripts\Server\areaserver.py", line 347, in c_api_client_connect
    File "T:\InGame\Gameplay\Scripts\Server\zone.py", line 536, in do_zone_spin_up
    File "T:\InGame\Gameplay\Scripts\Server\zone_spin_up_service.py", line 1178, in update
    File "T:\InGame\Gameplay\Scripts\Server\zone_spin_up_service.py", line 206, in on_enter
    File "T:\InGame\Gameplay\Scripts\Server\sims\household_manager.py", line 81, in load_households
    File "T:\InGame\Gameplay\Scripts\Server\sims\household_manager.py", line 161, in _load_household_from_household_proto
    File "T:\InGame\Gameplay\Scripts\Server\sims\household.py", line 1096, in load_data
    File ".\mc_utils.py", line 114, in _wrapper_function
    File "T:\InGame\Gameplay\Scripts\Server\sims\household.py", line 1085, in load_data
    File "T:\InGame\Gameplay\Scripts\Server\sims\sim_info.py", line 2600, in load_sim_info
    File "T:\InGame\Gameplay\Scripts\Server\sims\sim_info.py", line 2742, in _load_sim_info
    File "T:\InGame\Gameplay\Scripts\Server\traits\trait_tracker.py", line 767, in load
    File "T:\InGame\Gameplay\Scripts\Server\sims\occult\sim_info_with_occult_tracker.py", line 72, in add_trait
    File "T:\InGame\Gameplay\Scripts\Server\traits\trait_tracker.py", line 61, in add_trait
    File "T:\InGame\Gameplay\Scripts\Server\traits\trait_tracker.py", line 392, in _add_trait
    File "T:\InGame\Gameplay\Scripts\Server\traits\trait_tracker.py", line 634, in _add_buffs
    File "T:\InGame\Gameplay\Scripts\Server\objects\components\__init__.py", line 440, in exported_func
    File "T:\InGame\Gameplay\Scripts\Server\objects\components\buff_component.py", line 297, in add_buff
    File "T:\InGame\Gameplay\Scripts\Server\buffs\buff.py", line 995, in on_add
    File "T:\InGame\Gameplay\Scripts\Server\buffs\appearance_modifier\appearance_tracker.py", line 95, in add_appearance_modifiers
    File "T:\InGame\Gameplay\Scripts\Server\buffs\appearance_modifier\appearance_tracker.py", line 158, in evaluate_appearance_modifiers
    File "T:\InGame\Gameplay\Scripts\Server\buffs\appearance_modifier\appearance_modifier.py", line 226, in combinable_sorting_key
    TypeError: Failed to parse argument.

    2ce72f41bd3fec0545b21b101desyncea.maxis.sims4_64.15.pc2018-06-13 20:07:50Local.Unknown.Unknown.1.43.14.1020-1.200.000.339.Releaseappearance_modifier.py:226ce72f41bd3fec0545b21b101[manus] Sim 659785197400491370 failed to load (TypeError: Failed to parse argument.)
    Traceback (most recent call last):
    File "T:\InGame\Gameplay\Scripts\Server\areaserver.py", line 111, in wrapped
    File "T:\InGame\Gameplay\Scripts\Server\areaserver.py", line 107, in finally_wrap
    File "T:\InGame\Gameplay\Scripts\Core\sims4\utils.py", line 174, in wrapper
    File "T:\InGame\Gameplay\Scripts\Core\sims4\utils.py", line 192, in wrapper
    File "T:\InGame\Gameplay\Scripts\Server\areaserver.py", line 347, in c_api_client_connect
    File "T:\InGame\Gameplay\Scripts\Server\zone.py", line 536, in do_zone_spin_up
    File "T:\InGame\Gameplay\Scripts\Server\zone_spin_up_service.py", line 1178, in update
    File "T:\InGame\Gameplay\Scripts\Server\zone_spin_up_service.py", line 206, in on_enter
    File "T:\InGame\Gameplay\Scripts\Server\sims\household_manager.py", line 81, in load_households
    File "T:\InGame\Gameplay\Scripts\Server\sims\household_manager.py", line 161, in _load_household_from_household_proto
    File "T:\InGame\Gameplay\Scripts\Server\sims\household.py", line 1096, in load_data
    File ".\mc_utils.py", line 114, in _wrapper_function
    File "T:\InGame\Gameplay\Scripts\Server\sims\household.py", line 1085, in load_data
    File "T:\InGame\Gameplay\Scripts\Server\sims\sim_info.py", line 2600, in load_sim_info
    File "T:\InGame\Gameplay\Scripts\Server\sims\sim_info.py", line 2742, in _load_sim_info
    File "T:\InGame\Gameplay\Scripts\Server\traits\trait_tracker.py", line 767, in load
    File "T:\InGame\Gameplay\Scripts\Server\sims\occult\sim_info_with_occult_tracker.py", line 72, in add_trait
    File "T:\InGame\Gameplay\Scripts\Server\traits\trait_tracker.py", line 61, in add_trait
    File "T:\InGame\Gameplay\Scripts\Server\traits\trait_tracker.py", line 392, in _add_trait
    File "T:\InGame\Gameplay\Scripts\Server\traits\trait_tracker.py", line 634, in _add_buffs
    File "T:\InGame\Gameplay\Scripts\Server\objects\components\__init__.py", line 440, in exported_func
    File "T:\InGame\Gameplay\Scripts\Server\objects\components\buff_component.py", line 297, in add_buff
    File "T:\InGame\Gameplay\Scripts\Server\buffs\buff.py", line 995, in on_add
    File "T:\InGame\Gameplay\Scripts\Server\buffs\appearance_modifier\appearance_tracker.py", line 95, in add_appearance_modifiers
    File "T:\InGame\Gameplay\Scripts\Server\buffs\appearance_modifier\appearance_tracker.py", line 158, in evaluate_appearance_modifiers
    File "T:\InGame\Gameplay\Scripts\Server\buffs\appearance_modifier\appearance_modifier.py", line 226, in combinable_sorting_key
    TypeError: Failed to parse argument.

    2ce72f41bd3fec0545b21b101desyncea.maxis.sims4_64.15.pc2018-06-13 20:07:50Local.Unknown.Unknown.1.43.14.1020-1.200.000.339.Releaseappearance_modifier.py:226ce72f41bd3fec0545b21b101[manus] Sim 722833485767705216 failed to load (TypeError: Failed to parse argument.)
    Traceback (most recent call last):
    File "T:\InGame\Gameplay\Scripts\Server\areaserver.py", line 111, in wrapped
    File "T:\InGame\Gameplay\Scripts\Server\areaserver.py", line 107, in finally_wrap
    File "T:\InGame\Gameplay\Scripts\Core\sims4\utils.py", line 174, in wrapper
    File "T:\InGame\Gameplay\Scripts\Core\sims4\utils.py", line 192, in wrapper
    File "T:\InGame\Gameplay\Scripts\Server\areaserver.py", line 347, in c_api_client_connect
    File "T:\InGame\Gameplay\Scripts\Server\zone.py", line 536, in do_zone_spin_up
    File "T:\InGame\Gameplay\Scripts\Server\zone_spin_up_service.py", line 1178, in update
    File "T:\InGame\Gameplay\Scripts\Server\zone_spin_up_service.py", line 206, in on_enter
    File "T:\InGame\Gameplay\Scripts\Server\sims\household_manager.py", line 81, in load_households
    File "T:\InGame\Gameplay\Scripts\Server\sims\household_manager.py", line 161, in _load_household_from_household_proto
    File "T:\InGame\Gameplay\Scripts\Server\sims\household.py", line 1096, in load_data
    File ".\mc_utils.py", line 114, in _wrapper_function
    File "T:\InGame\Gameplay\Scripts\Server\sims\household.py", line 1085, in load_data
    File "T:\InGame\Gameplay\Scripts\Server\sims\sim_info.py", line 2600, in load_sim_info
    File "T:\InGame\Gameplay\Scripts\Server\sims\sim_info.py", line 2742, in _load_sim_info
    File "T:\InGame\Gameplay\Scripts\Server\traits\trait_tracker.py", line 767, in load
    File "T:\InGame\Gameplay\Scripts\Server\sims\occult\sim_info_with_occult_tracker.py", line 72, in add_trait
    File "T:\InGame\Gameplay\Scripts\Server\traits\trait_tracker.py", line 61, in add_trait
    File "T:\InGame\Gameplay\Scripts\Server\traits\trait_tracker.py", line 392, in _add_trait
    File "T:\InGame\Gameplay\Scripts\Server\traits\trait_tracker.py", line 634, in _add_buffs
    File "T:\InGame\Gameplay\Scripts\Server\objects\components\__init__.py", line 440, in exported_func
    File "T:\InGame\Gameplay\Scripts\Server\objects\components\buff_component.py", line 297, in add_buff
    File "T:\InGame\Gameplay\Scripts\Server\buffs\buff.py", line 995, in on_add
    File "T:\InGame\Gameplay\Scripts\Server\buffs\appearance_modifier\appearance_tracker.py", line 95, in add_appearance_modifiers
    File "T:\InGame\Gameplay\Scripts\Server\buffs\appearance_modifier\appearance_tracker.py", line 158, in evaluate_appearance_modifiers
    File "T:\InGame\Gameplay\Scripts\Server\buffs\appearance_modifier\appearance_modifier.py", line 226, in combinable_sorting_key
    TypeError: Failed to parse argument.
  • amym996amym996 Posts: 1 New Member
    Hi guys, I'm having trouble making my game work with MCCC. MCCC shows up properly and everything but the orange notifications about last exceptions etc keep showing up. This is what shows up in the last exception folders - could anyone help me figure out whether it's telling me what CC / mod I need to remove?

    <?xml version="1.0" ?>
    23c3c88d14e8cbf985b229674desyncea.maxis.sims4_64.15.pc2018-06-14 17:40:16Local.Unknown.Unknown.1.43.14.1020-1.200.000.339.Releasesim_focus.py:1943c3c88d14e8cbf985b229674Exception in Sim Timeline: Exception running Element (AttributeError: 'prototype' object has no attribute 'get_focus_bone')
    Traceback (most recent call last):
    File "T:\InGame\Gameplay\Scripts\Server\scheduling.py", line 212, in simulate
    File "T:\InGame\Gameplay\Scripts\Server\elements.py", line 376, in _run
    File "T:\InGame\Gameplay\Scripts\Server\interactions\base\interaction.py", line 5789, in _do_perform_gen
    File "T:\InGame\Gameplay\Scripts\Server\interactions\base\interaction.py", line 5782, in _get_behavior
    File "T:\InGame\Gameplay\Scripts\Server\interactions\base\super_interaction.py", line 3813, in build_basic_elements
    File "T:\InGame\Gameplay\Scripts\Server\interactions\base\interaction.py", line 6027, in build_basic_elements
    File "T:\InGame\Gameplay\Scripts\Core\sims4\tuning\tunable.py", line 510, in __call__
    File "T:\InGame\Gameplay\Scripts\Server\interactions\utils\sim_focus.py", line 252, in factory
    File "T:\InGame\Gameplay\Scripts\Server\interactions\utils\sim_focus.py", line 222, in with_sim_focus
    File "T:\InGame\Gameplay\Scripts\Server\interactions\utils\sim_focus.py", line 194, in __init__
    AttributeError: 'prototype' object has no attribute 'get_focus_bone'

    23c3c88d14e8cbf985b229674desyncea.maxis.sims4_64.15.pc2018-06-14 17:41:27Local.Unknown.Unknown.1.43.14.1020-1.200.000.339.Releasesim_focus.py:1943c3c88d14e8cbf985b229674Exception in Sim Timeline: Exception running Element (AttributeError: 'prototype' object has no attribute 'get_focus_bone')
    Traceback (most recent call last):
    File "T:\InGame\Gameplay\Scripts\Server\scheduling.py", line 212, in simulate
    File "T:\InGame\Gameplay\Scripts\Server\elements.py", line 376, in _run
    File "T:\InGame\Gameplay\Scripts\Server\interactions\base\interaction.py", line 5789, in _do_perform_gen
    File "T:\InGame\Gameplay\Scripts\Server\interactions\base\interaction.py", line 5782, in _get_behavior
    File "T:\InGame\Gameplay\Scripts\Server\interactions\base\super_interaction.py", line 3813, in build_basic_elements
    File "T:\InGame\Gameplay\Scripts\Server\interactions\base\interaction.py", line 6027, in build_basic_elements
    File "T:\InGame\Gameplay\Scripts\Core\sims4\tuning\tunable.py", line 510, in __call__
    File "T:\InGame\Gameplay\Scripts\Server\interactions\utils\sim_focus.py", line 252, in factory
    File "T:\InGame\Gameplay\Scripts\Server\interactions\utils\sim_focus.py", line 222, in with_sim_focus
    File "T:\InGame\Gameplay\Scripts\Server\interactions\utils\sim_focus.py", line 194, in __init__
    AttributeError: 'prototype' object has no attribute 'get_focus_bone'

    23c3c88d14e8cbf985b229674desyncea.maxis.sims4_64.15.pc2018-06-14 17:41:51Local.Unknown.Unknown.1.43.14.1020-1.200.000.339.Releasesim_focus.py:1943c3c88d14e8cbf985b229674Exception in Sim Timeline: Exception running Element (AttributeError: 'prototype' object has no attribute 'get_focus_bone')
    Traceback (most recent call last):
    File "T:\InGame\Gameplay\Scripts\Server\scheduling.py", line 212, in simulate
    File "T:\InGame\Gameplay\Scripts\Server\elements.py", line 376, in _run
    File "T:\InGame\Gameplay\Scripts\Server\interactions\base\interaction.py", line 5789, in _do_perform_gen
    File "T:\InGame\Gameplay\Scripts\Server\interactions\base\interaction.py", line 5782, in _get_behavior
    File "T:\InGame\Gameplay\Scripts\Server\interactions\base\super_interaction.py", line 3813, in build_basic_elements
    File "T:\InGame\Gameplay\Scripts\Server\interactions\base\interaction.py", line 6027, in build_basic_elements
    File "T:\InGame\Gameplay\Scripts\Core\sims4\tuning\tunable.py", line 510, in __call__
    File "T:\InGame\Gameplay\Scripts\Server\interactions\utils\sim_focus.py", line 252, in factory
    File "T:\InGame\Gameplay\Scripts\Server\interactions\utils\sim_focus.py", line 222, in with_sim_focus
    File "T:\InGame\Gameplay\Scripts\Server\interactions\utils\sim_focus.py", line 194, in __init__
    AttributeError: 'prototype' object has no attribute 'get_focus_bone'
  • rosemowrosemow Posts: 142,038 Member
    Hello @confusedsimmer2
    If you have custom traits , these could be causing issues. Try removing any custom traits that you have and see if you still get the last exceptions errors. Then go to where you downloaded the traits and see if there are updated versions of the traits.
  • rosemowrosemow Posts: 142,038 Member
    edited June 2018
    amym996 wrote: »
    Hi guys, I'm having trouble making my game work with MCCC. MCCC shows up properly and everything but the orange notifications about last exceptions etc keep showing up. This is what shows up in the last exception folders - could anyone help me figure out whether it's telling me what CC / mod I need to remove?

    <?xml version="1.0" ?>
    23c3c88d14e8cbf985b229674desyncea.maxis.sims4_64.15.pc2018-06-14 17:40:16Local.Unknown.Unknown.1.43.14.1020-1.200.000.339.Releasesim_focus.py:1943c3c88d14e8cbf985b229674Exception in Sim Timeline: Exception running Element (AttributeError: 'prototype' object has no attribute 'get_focus_bone')
    Traceback (most recent call last):
    File "T:\InGame\Gameplay\Scripts\Server\scheduling.py", line 212, in simulate
    File "T:\InGame\Gameplay\Scripts\Server\elements.py", line 376, in _run
    File "T:\InGame\Gameplay\Scripts\Server\interactions\base\interaction.py", line 5789, in _do_perform_gen
    File "T:\InGame\Gameplay\Scripts\Server\interactions\base\interaction.py", line 5782, in _get_behavior
    File "T:\InGame\Gameplay\Scripts\Server\interactions\base\super_interaction.py", line 3813, in build_basic_elements
    File "T:\InGame\Gameplay\Scripts\Server\interactions\base\interaction.py", line 6027, in build_basic_elements
    File "T:\InGame\Gameplay\Scripts\Core\sims4\tuning\tunable.py", line 510, in __call__
    File "T:\InGame\Gameplay\Scripts\Server\interactions\utils\sim_focus.py", line 252, in factory
    File "T:\InGame\Gameplay\Scripts\Server\interactions\utils\sim_focus.py", line 222, in with_sim_focus
    File "T:\InGame\Gameplay\Scripts\Server\interactions\utils\sim_focus.py", line 194, in __init__
    AttributeError: 'prototype' object has no attribute 'get_focus_bone'

    23c3c88d14e8cbf985b229674desyncea.maxis.sims4_64.15.pc2018-06-14 17:41:27Local.Unknown.Unknown.1.43.14.1020-1.200.000.339.Releasesim_focus.py:1943c3c88d14e8cbf985b229674Exception in Sim Timeline: Exception running Element (AttributeError: 'prototype' object has no attribute 'get_focus_bone')
    Traceback (most recent call last):
    File "T:\InGame\Gameplay\Scripts\Server\scheduling.py", line 212, in simulate
    File "T:\InGame\Gameplay\Scripts\Server\elements.py", line 376, in _run
    File "T:\InGame\Gameplay\Scripts\Server\interactions\base\interaction.py", line 5789, in _do_perform_gen
    File "T:\InGame\Gameplay\Scripts\Server\interactions\base\interaction.py", line 5782, in _get_behavior
    File "T:\InGame\Gameplay\Scripts\Server\interactions\base\super_interaction.py", line 3813, in build_basic_elements
    File "T:\InGame\Gameplay\Scripts\Server\interactions\base\interaction.py", line 6027, in build_basic_elements
    File "T:\InGame\Gameplay\Scripts\Core\sims4\tuning\tunable.py", line 510, in __call__
    File "T:\InGame\Gameplay\Scripts\Server\interactions\utils\sim_focus.py", line 252, in factory
    File "T:\InGame\Gameplay\Scripts\Server\interactions\utils\sim_focus.py", line 222, in with_sim_focus
    File "T:\InGame\Gameplay\Scripts\Server\interactions\utils\sim_focus.py", line 194, in __init__
    AttributeError: 'prototype' object has no attribute 'get_focus_bone'

    23c3c88d14e8cbf985b229674desyncea.maxis.sims4_64.15.pc2018-06-14 17:41:51Local.Unknown.Unknown.1.43.14.1020-1.200.000.339.Releasesim_focus.py:1943c3c88d14e8cbf985b229674Exception in Sim Timeline: Exception running Element (AttributeError: 'prototype' object has no attribute 'get_focus_bone')
    Traceback (most recent call last):
    File "T:\InGame\Gameplay\Scripts\Server\scheduling.py", line 212, in simulate
    File "T:\InGame\Gameplay\Scripts\Server\elements.py", line 376, in _run
    File "T:\InGame\Gameplay\Scripts\Server\interactions\base\interaction.py", line 5789, in _do_perform_gen
    File "T:\InGame\Gameplay\Scripts\Server\interactions\base\interaction.py", line 5782, in _get_behavior
    File "T:\InGame\Gameplay\Scripts\Server\interactions\base\super_interaction.py", line 3813, in build_basic_elements
    File "T:\InGame\Gameplay\Scripts\Server\interactions\base\interaction.py", line 6027, in build_basic_elements
    File "T:\InGame\Gameplay\Scripts\Core\sims4\tuning\tunable.py", line 510, in __call__
    File "T:\InGame\Gameplay\Scripts\Server\interactions\utils\sim_focus.py", line 252, in factory
    File "T:\InGame\Gameplay\Scripts\Server\interactions\utils\sim_focus.py", line 222, in with_sim_focus
    File "T:\InGame\Gameplay\Scripts\Server\interactions\utils\sim_focus.py", line 194, in __init__
    AttributeError: 'prototype' object has no attribute 'get_focus_bone'

    Hello @amym996

    Littlemissam has a mod fix for your issue.
    http://littlemssam.de/random-bug-fixes/

    “For those who have Problems with Pets sniffing Objects and causing Errors because of missing Focus Bones: I don’t use MC Tuner so i tried to make a fix Mod for this. Within this fix i added a Object State Test which lets Pets only sniff at Objects that are not burning. This should prevend Pets to sniff on Clutter you used with the BuyDebug Cheat or CC Clutter that don’t have a Tuning File. I tried it out and so far it seems to work fine at least with the Sniff new Objects Interaction. It does not work for CC which have their own outdated Tuning Files!”


  • Alexis321Alexis321 Posts: 2 New Member
    Can someone help me, please <3

    <?xml version="1.0" ?>
    2fe9e617ff47db5ec5b2328eedesyncea.maxis.sims4_64.15.pc2018-06-15 00:08:41Local.Unknown.Unknown.1.43.14.1020-1.200.000.339.Releaseconstraints.py:2187fe9e617ff47db5ec5b2328ee[rez] Posture graph threw an exception while being queried by autonomy: (AttributeError: 'UnsetType' object has no attribute 'surface_types')
    Traceback (most recent call last):
    Caught and logged:
    File "T:\InGame\Gameplay\Scripts\Core\sims4\utils.py", line 196, in wrapper
    File "T:\InGame\Gameplay\Scripts\Server\areaserver.py", line 203, in c_api_server_tick
    File "T:\InGame\Gameplay\Scripts\Server\zone.py", line 456, in update
    File "T:\InGame\Gameplay\Scripts\Server\time_service.py", line 112, in update
    File "T:\InGame\Gameplay\Scripts\Server\scheduling.py", line 217, in simulate
    File "T:\InGame\Gameplay\Scripts\Server\elements.py", line 385, in _resume
    File "T:\InGame\Gameplay\Scripts\Server\crafting\crafting_interactions.py", line 1603, in _do_perform_gen
    File "T:\InGame\Gameplay\Scripts\Server\crafting\crafting_interactions.py", line 1485, in _go_to_next_phase
    File "T:\InGame\Gameplay\Scripts\Server\crafting\crafting_process.py", line 1415, in push_si_for_current_phase
    File "T:\InGame\Gameplay\Scripts\Server\crafting\crafting_process.py", line 1372, in _push_si_for_phases
    File "T:\InGame\Gameplay\Scripts\Server\crafting\crafting_process.py", line 1187, in _create_aop_and_context_for_phases
    File "T:\InGame\Gameplay\Scripts\Server\crafting\crafting_process.py", line 1311, in _choose_phase_and_create_aop_and_context
    File "T:\InGame\Gameplay\Scripts\Server\crafting\crafting_process.py", line 1290, in _find_phase_affordances
    File "T:\InGame\Gameplay\Scripts\Server\crafting\crafting_process.py", line 1249, in run_request
    File "T:\InGame\Gameplay\Scripts\Server\autonomy\autonomy_service.py", line 172, in score_all_interactions
    File "T:\InGame\Gameplay\Scripts\Server\autonomy\autonomy_service.py", line 188, in score_all_interactions_gen
    File "T:\InGame\Gameplay\Scripts\Server\autonomy\autonomy_modes.py", line 249, in run_gen
    File "T:\InGame\Gameplay\Scripts\Server\autonomy\autonomy_modes.py", line 1360, in _run_gen
    File "T:\InGame\Gameplay\Scripts\Server\autonomy\autonomy_modes.py", line 1746, in _score_object_interactions_gen
    File "T:\InGame\Gameplay\Scripts\Server\autonomy\autonomy_modes.py", line 1837, in _create_and_score_interaction
    File ".\mc_utils.py", line 114, in _wrapper_function
    File ".\mc_injections.py", line 773, in inject_last_exception_log
    File "T:\InGame\Gameplay\Scripts\Core\caches.py", line 144, in wrapper
    KeyError: (ConstraintSet(...), _TunableAffordanceFilterWrapper._filter, False, , frozenset({}), frozenset({(, ), (, ), (, )}))

    During handling of the above exception, another exception occurred:

    Traceback (most recent call last):
    File "T:\InGame\Gameplay\Scripts\Server\autonomy\autonomy_modes.py", line 1834, in _create_and_score_interaction
    File "T:\InGame\Gameplay\Scripts\Server\autonomy\autonomy_modes.py", line 1014, in _calculate_route_time_and_opportunity
    File "T:\InGame\Gameplay\Scripts\Core\caches.py", line 156, in wrapper
    File "T:\InGame\Gameplay\Scripts\Server\interactions\base\super_interaction.py", line 2371, in estimate_distance
    File "T:\InGame\Gameplay\Scripts\Server\interactions\base\super_interaction.py", line 2411, in _estimate_distance
    File "T:\InGame\Gameplay\Scripts\Server\interactions\base\super_interaction.py", line 2290, in _generate_connectivity
    File "T:\InGame\Gameplay\Scripts\Server\postures\transition_sequence.py", line 1438, in compute_transition_connectivity
    File "T:\InGame\Gameplay\Scripts\Server\postures\transition_sequence.py", line 1485, in run_transitions
    File "T:\InGame\Gameplay\Scripts\Server\postures\transition_sequence.py", line 3333, in _build_transitions
    File "T:\InGame\Gameplay\Scripts\Server\postures\transition_sequence.py", line 3124, in _build_and_log_transitions_for_sim
    File "T:\InGame\Gameplay\Scripts\Server\postures\transition_sequence.py", line 3186, in _build_transitions_for_sim
    File "T:\InGame\Gameplay\Scripts\Server\postures\transition_sequence.py", line 2675, in get_transitions_for_sim
    File "T:\InGame\Gameplay\Scripts\Server\postures\transition_sequence.py", line 2806, in _get_transitions_for_sim
    File "T:\InGame\Gameplay\Scripts\Server\postures\transition_sequence.py", line 2079, in get_templates_including_carry_transference
    File "T:\InGame\Gameplay\Scripts\Server\postures\transition_sequence.py", line 1910, in _get_specs_for_constraints
    File "T:\InGame\Gameplay\Scripts\Server\interactions\constraints.py", line 2187, in get_posture_specs
    AttributeError: 'UnsetType' object has no attribute 'surface_types'

    2fe9e617ff47db5ec5b2328eedesyncea.maxis.sims4_64.15.pc2018-06-15 00:21:12Local.Unknown.Unknown.1.43.14.1020-1.200.000.339.Releaseconstraints.py:2187fe9e617ff47db5ec5b2328ee[rez] Posture graph threw an exception while being queried by autonomy: (AttributeError: 'UnsetType' object has no attribute 'surface_types')
    Traceback (most recent call last):
    Caught and logged:
    File "T:\InGame\Gameplay\Scripts\Core\sims4\utils.py", line 196, in wrapper
    File "T:\InGame\Gameplay\Scripts\Server\areaserver.py", line 203, in c_api_server_tick
    File "T:\InGame\Gameplay\Scripts\Server\zone.py", line 456, in update
    File "T:\InGame\Gameplay\Scripts\Server\time_service.py", line 112, in update
    File "T:\InGame\Gameplay\Scripts\Server\scheduling.py", line 217, in simulate
    File "T:\InGame\Gameplay\Scripts\Server\elements.py", line 385, in _resume
    File "T:\InGame\Gameplay\Scripts\Server\crafting\crafting_interactions.py", line 1603, in _do_perform_gen
    File "T:\InGame\Gameplay\Scripts\Server\crafting\crafting_interactions.py", line 1485, in _go_to_next_phase
    File "T:\InGame\Gameplay\Scripts\Server\crafting\crafting_process.py", line 1415, in push_si_for_current_phase
    File "T:\InGame\Gameplay\Scripts\Server\crafting\crafting_process.py", line 1372, in _push_si_for_phases
    File "T:\InGame\Gameplay\Scripts\Server\crafting\crafting_process.py", line 1187, in _create_aop_and_context_for_phases
    File "T:\InGame\Gameplay\Scripts\Server\crafting\crafting_process.py", line 1311, in _choose_phase_and_create_aop_and_context
    File "T:\InGame\Gameplay\Scripts\Server\crafting\crafting_process.py", line 1290, in _find_phase_affordances
    File "T:\InGame\Gameplay\Scripts\Server\crafting\crafting_process.py", line 1249, in run_request
    File "T:\InGame\Gameplay\Scripts\Server\autonomy\autonomy_service.py", line 172, in score_all_interactions
    File "T:\InGame\Gameplay\Scripts\Server\autonomy\autonomy_service.py", line 188, in score_all_interactions_gen
    File "T:\InGame\Gameplay\Scripts\Server\autonomy\autonomy_modes.py", line 249, in run_gen
    File "T:\InGame\Gameplay\Scripts\Server\autonomy\autonomy_modes.py", line 1360, in _run_gen
    File "T:\InGame\Gameplay\Scripts\Server\autonomy\autonomy_modes.py", line 1746, in _score_object_interactions_gen
    File "T:\InGame\Gameplay\Scripts\Server\autonomy\autonomy_modes.py", line 1837, in _create_and_score_interaction
    File ".\mc_utils.py", line 114, in _wrapper_function
    File ".\mc_injections.py", line 773, in inject_last_exception_log
    File "T:\InGame\Gameplay\Scripts\Core\caches.py", line 144, in wrapper
    KeyError: (ConstraintSet(...), _TunableAffordanceFilterWrapper._filter, False, , frozenset({}), frozenset({(, ), (, ), (, )}))

    During handling of the above exception, another exception occurred:

    Traceback (most recent call last):
    File "T:\InGame\Gameplay\Scripts\Server\autonomy\autonomy_modes.py", line 1834, in _create_and_score_interaction
    File "T:\InGame\Gameplay\Scripts\Server\autonomy\autonomy_modes.py", line 1014, in _calculate_route_time_and_opportunity
    File "T:\InGame\Gameplay\Scripts\Core\caches.py", line 156, in wrapper
    File "T:\InGame\Gameplay\Scripts\Server\interactions\base\super_interaction.py", line 2371, in estimate_distance
    File "T:\InGame\Gameplay\Scripts\Server\interactions\base\super_interaction.py", line 2411, in _estimate_distance
    File "T:\InGame\Gameplay\Scripts\Server\interactions\base\super_interaction.py", line 2290, in _generate_connectivity
    File "T:\InGame\Gameplay\Scripts\Server\postures\transition_sequence.py", line 1438, in compute_transition_connectivity
    File "T:\InGame\Gameplay\Scripts\Server\postures\transition_sequence.py", line 1485, in run_transitions
    File "T:\InGame\Gameplay\Scripts\Server\postures\transition_sequence.py", line 3333, in _build_transitions
    File "T:\InGame\Gameplay\Scripts\Server\postures\transition_sequence.py", line 3124, in _build_and_log_transitions_for_sim
    File "T:\InGame\Gameplay\Scripts\Server\postures\transition_sequence.py", line 3186, in _build_transitions_for_sim
    File "T:\InGame\Gameplay\Scripts\Server\postures\transition_sequence.py", line 2675, in get_transitions_for_sim
    File "T:\InGame\Gameplay\Scripts\Server\postures\transition_sequence.py", line 2806, in _get_transitions_for_sim
    File "T:\InGame\Gameplay\Scripts\Server\postures\transition_sequence.py", line 2079, in get_templates_including_carry_transference
    File "T:\InGame\Gameplay\Scripts\Server\postures\transition_sequence.py", line 1910, in _get_specs_for_constraints
    File "T:\InGame\Gameplay\Scripts\Server\interactions\constraints.py", line 2187, in get_posture_specs
    AttributeError: 'UnsetType' object has no attribute 'surface_types'

    2fe9e617ff47db5ec5b2328eedesyncea.maxis.sims4_64.15.pc2018-06-15 00:22:30Local.Unknown.Unknown.1.43.14.1020-1.200.000.339.Releaseconstraints.py:2187fe9e617ff47db5ec5b2328ee[rez] Posture graph threw an exception while being queried by autonomy: (AttributeError: 'UnsetType' object has no attribute 'surface_types')
    Traceback (most recent call last):
    Caught and logged:
    File "T:\InGame\Gameplay\Scripts\Core\sims4\utils.py", line 196, in wrapper
    File "T:\InGame\Gameplay\Scripts\Server\areaserver.py", line 203, in c_api_server_tick
    File "T:\InGame\Gameplay\Scripts\Server\zone.py", line 456, in update
    File "T:\InGame\Gameplay\Scripts\Server\time_service.py", line 112, in update
    File "T:\InGame\Gameplay\Scripts\Server\scheduling.py", line 217, in simulate
    File "T:\InGame\Gameplay\Scripts\Server\elements.py", line 385, in _resume
    File "T:\InGame\Gameplay\Scripts\Server\crafting\crafting_interactions.py", line 1603, in _do_perform_gen
    File "T:\InGame\Gameplay\Scripts\Server\crafting\crafting_interactions.py", line 1485, in _go_to_next_phase
    File "T:\InGame\Gameplay\Scripts\Server\crafting\crafting_process.py", line 1415, in push_si_for_current_phase
    File "T:\InGame\Gameplay\Scripts\Server\crafting\crafting_process.py", line 1372, in _push_si_for_phases
    File "T:\InGame\Gameplay\Scripts\Server\crafting\crafting_process.py", line 1187, in _create_aop_and_context_for_phases
    File "T:\InGame\Gameplay\Scripts\Server\crafting\crafting_process.py", line 1311, in _choose_phase_and_create_aop_and_context
    File "T:\InGame\Gameplay\Scripts\Server\crafting\crafting_process.py", line 1290, in _find_phase_affordances
    File "T:\InGame\Gameplay\Scripts\Server\crafting\crafting_process.py", line 1249, in run_request
    File "T:\InGame\Gameplay\Scripts\Server\autonomy\autonomy_service.py", line 172, in score_all_interactions
    File "T:\InGame\Gameplay\Scripts\Server\autonomy\autonomy_service.py", line 188, in score_all_interactions_gen
    File "T:\InGame\Gameplay\Scripts\Server\autonomy\autonomy_modes.py", line 249, in run_gen
    File "T:\InGame\Gameplay\Scripts\Server\autonomy\autonomy_modes.py", line 1360, in _run_gen
    File "T:\InGame\Gameplay\Scripts\Server\autonomy\autonomy_modes.py", line 1746, in _score_object_interactions_gen
    File "T:\InGame\Gameplay\Scripts\Server\autonomy\autonomy_modes.py", line 1837, in _create_and_score_interaction
    File ".\mc_utils.py", line 114, in _wrapper_function
    File ".\mc_injections.py", line 773, in inject_last_exception_log
    File "T:\InGame\Gameplay\Scripts\Core\caches.py", line 144, in wrapper
    KeyError: (ConstraintSet(...), _TunableAffordanceFilterWrapper._filter, False, , frozenset({}), frozenset({(, ), (, ), (, )}))

    During handling of the above exception, another exception occurred:

    Traceback (most recent call last):
    File "T:\InGame\Gameplay\Scripts\Server\autonomy\autonomy_modes.py", line 1834, in _create_and_score_interaction
    File "T:\InGame\Gameplay\Scripts\Server\autonomy\autonomy_modes.py", line 1014, in _calculate_route_time_and_opportunity
    File "T:\InGame\Gameplay\Scripts\Core\caches.py", line 156, in wrapper
    File "T:\InGame\Gameplay\Scripts\Server\interactions\base\super_interaction.py", line 2371, in estimate_distance
    File "T:\InGame\Gameplay\Scripts\Server\interactions\base\super_interaction.py", line 2411, in _estimate_distance
    File "T:\InGame\Gameplay\Scripts\Server\interactions\base\super_interaction.py", line 2290, in _generate_connectivity
    File "T:\InGame\Gameplay\Scripts\Server\postures\transition_sequence.py", line 1438, in compute_transition_connectivity
    File "T:\InGame\Gameplay\Scripts\Server\postures\transition_sequence.py", line 1485, in run_transitions
    File "T:\InGame\Gameplay\Scripts\Server\postures\transition_sequence.py", line 3333, in _build_transitions
    File "T:\InGame\Gameplay\Scripts\Server\postures\transition_sequence.py", line 3124, in _build_and_log_transitions_for_sim
    File "T:\InGame\Gameplay\Scripts\Server\postures\transition_sequence.py", line 3186, in _build_transitions_for_sim
    File "T:\InGame\Gameplay\Scripts\Server\postures\transition_sequence.py", line 2675, in get_transitions_for_sim
    File "T:\InGame\Gameplay\Scripts\Server\postures\transition_sequence.py", line 2806, in _get_transitions_for_sim
    File "T:\InGame\Gameplay\Scripts\Server\postures\transition_sequence.py", line 2079, in get_templates_including_carry_transference
    File "T:\InGame\Gameplay\Scripts\Server\postures\transition_sequence.py", line 1910, in _get_specs_for_constraints
    File "T:\InGame\Gameplay\Scripts\Server\interactions\constraints.py", line 2187, in get_posture_specs
    AttributeError: 'UnsetType' object has no attribute 'surface_types'

    2fe9e617ff47db5ec5b2328eedesyncea.maxis.sims4_64.15.pc2018-06-15 00:24:57Local.Unknown.Unknown.1.43.14.1020-1.200.000.339.Releaseconstraints.py:2187fe9e617ff47db5ec5b2328ee[rez] Posture graph threw an exception while being queried by autonomy: (AttributeError: 'UnsetType' object has no attribute 'surface_types')
    Traceback (most recent call last):
    Caught and logged:
    File "T:\InGame\Gameplay\Scripts\Core\sims4\utils.py", line 196, in wrapper
    File "T:\InGame\Gameplay\Scripts\Server\areaserver.py", line 203, in c_api_server_tick
    File "T:\InGame\Gameplay\Scripts\Server\zone.py", line 456, in update
    File "T:\InGame\Gameplay\Scripts\Server\time_service.py", line 112, in update
    File "T:\InGame\Gameplay\Scripts\Server\scheduling.py", line 217, in simulate
    File "T:\InGame\Gameplay\Scripts\Server\elements.py", line 385, in _resume
    File "T:\InGame\Gameplay\Scripts\Server\crafting\crafting_interactions.py", line 1603, in _do_perform_gen
    File "T:\InGame\Gameplay\Scripts\Server\crafting\crafting_interactions.py", line 1485, in _go_to_next_phase
    File "T:\InGame\Gameplay\Scripts\Server\crafting\crafting_process.py", line 1415, in push_si_for_current_phase
    File "T:\InGame\Gameplay\Scripts\Server\crafting\crafting_process.py", line 1372, in _push_si_for_phases
    File "T:\InGame\Gameplay\Scripts\Server\crafting\crafting_process.py", line 1187, in _create_aop_and_context_for_phases
    File "T:\InGame\Gameplay\Scripts\Server\crafting\crafting_process.py", line 1311, in _choose_phase_and_create_aop_and_context
    File "T:\InGame\Gameplay\Scripts\Server\crafting\crafting_process.py", line 1290, in _find_phase_affordances
    File "T:\InGame\Gameplay\Scripts\Server\crafting\crafting_process.py", line 1249, in run_request
    File "T:\InGame\Gameplay\Scripts\Server\autonomy\autonomy_service.py", line 172, in score_all_interactions
    File "T:\InGame\Gameplay\Scripts\Server\autonomy\autonomy_service.py", line 188, in score_all_interactions_gen
    File "T:\InGame\Gameplay\Scripts\Server\autonomy\autonomy_modes.py", line 249, in run_gen
    File "T:\InGame\Gameplay\Scripts\Server\autonomy\autonomy_modes.py", line 1360, in _run_gen
    File "T:\InGame\Gameplay\Scripts\Server\autonomy\autonomy_modes.py", line 1746, in _score_object_interactions_gen
    File "T:\InGame\Gameplay\Scripts\Server\autonomy\autonomy_modes.py", line 1837, in _create_and_score_interaction
    File ".\mc_utils.py", line 114, in _wrapper_function
    File ".\mc_injections.py", line 773, in inject_last_exception_log
    File "T:\InGame\Gameplay\Scripts\Core\caches.py", line 144, in wrapper
    KeyError: (ConstraintSet(...), _TunableAffordanceFilterWrapper._filter, False, , frozenset({}), frozenset({(, ), (, ), (, )}))

    During handling of the above exception, another exception occurred:

    Traceback (most recent call last):
    File "T:\InGame\Gameplay\Scripts\Server\autonomy\autonomy_modes.py", line 1834, in _create_and_score_interaction
    File "T:\InGame\Gameplay\Scripts\Server\autonomy\autonomy_modes.py", line 1014, in _calculate_route_time_and_opportunity
    File "T:\InGame\Gameplay\Scripts\Core\caches.py", line 156, in wrapper
    File "T:\InGame\Gameplay\Scripts\Server\interactions\base\super_interaction.py", line 2371, in estimate_distance
    File "T:\InGame\Gameplay\Scripts\Server\interactions\base\super_interaction.py", line 2411, in _estimate_distance
    File "T:\InGame\Gameplay\Scripts\Server\interactions\base\super_interaction.py", line 2290, in _generate_connectivity
    File "T:\InGame\Gameplay\Scripts\Server\postures\transition_sequence.py", line 1438, in compute_transition_connectivity
    File "T:\InGame\Gameplay\Scripts\Server\postures\transition_sequence.py", line 1485, in run_transitions
    File "T:\InGame\Gameplay\Scripts\Server\postures\transition_sequence.py", line 3333, in _build_transitions
    File "T:\InGame\Gameplay\Scripts\Server\postures\transition_sequence.py", line 3124, in _build_and_log_transitions_for_sim
    File "T:\InGame\Gameplay\Scripts\Server\postures\transition_sequence.py", line 3186, in _build_transitions_for_sim
    File "T:\InGame\Gameplay\Scripts\Server\postures\transition_sequence.py", line 2675, in get_transitions_for_sim
    File "T:\InGame\Gameplay\Scripts\Server\postures\transition_sequence.py", line 2806, in _get_transitions_for_sim
    File "T:\InGame\Gameplay\Scripts\Server\postures\transition_sequence.py", line 2079, in get_templates_including_carry_transference
    File "T:\InGame\Gameplay\Scripts\Server\postures\transition_sequence.py", line 1910, in _get_specs_for_constraints
    File "T:\InGame\Gameplay\Scripts\Server\interactions\constraints.py", line 2187, in get_posture_specs
    AttributeError: 'UnsetType' object has no attribute 'surface_types'
  • Bananas_45Bananas_45 Posts: 4,538 Member
    It looks like at least part of your problem is broken CC. You probably have a counter/table/bed/bookcase that needs to be updated with Sims 4 Studio.

    Once you have downloaded and installed Sims 4 Studio, choose Content Management from the main page, then Batch Fix, Objects; Fix Objects for Cats & Dog Patch; Run

    You can download Sims 4 Studio here http://sims4studio.com/ You will need to register to download but, membership is free. The program is safe as all CC is made with it.

    If that does not solve your problem I would suggest posting your last exception in the general support area at the MCCC discord: https://discordapp.com/invite/AUJ8RAa
  • LittleSimTuberLittleSimTuber Posts: 26 New Member
    i can't go to some restaurants because it sends me to the map with error and when i do go in game my ui is totaled with numbers and glitches




    <?xml version="1.0" ?>
    24bc4691ef5b8b9615b242673desyncea.maxis.sims4_64.15.pc2018-06-15 17:02:24Local.Unknown.Unknown.1.43.14.1020-1.200.000.339.Releasepart.py:1484bc4691ef5b8b9615b242673Exception in , args: (462190217815135785, 405895254863579593, {66A078DE7881629,0,World}, Transform(Vector3(293.470154, 154.657486, 299.463409), Quaternion(0.000000, 0.803197, 0.000000, 0.595713)), 0, (0, 0), 0), kwargs: {}
    KeyError('Unable to find joint b__subroot__3 on object_sitDecoBenchSO3x1_01:0x05a20795722909c9[4]',) (KeyError: 'Unable to find joint b__subroot__3 on object_sitDecoBenchSO3x1_01:0x05a20795722909c9[4]')
    Traceback (most recent call last):
    File "T:\InGame\Gameplay\Scripts\Core\sims4\utils.py", line 200, in wrapper
    File "T:\InGame\Gameplay\Scripts\Server\objects\part.py", line 146, in get_joint_transform
    File "T:\InGame\Gameplay\Scripts\Core\native\animation\__init__.py", line 239, in get_joint_transform_from_rig
    KeyError: 'get_joint_transform_from_rig: Joint name [b__subroot__3] was not found in the specified rig [c2c579b61b938d2a.8eaf13de]. JointNameHash [0]().'

    During handling of the above exception, another exception occurred:

    Traceback (most recent call last):
    File "T:\InGame\Gameplay\Scripts\Core\sims4\utils.py", line 196, in wrapper
    File "T:\InGame\Gameplay\Scripts\Server\build_buy.py", line 804, in c_api_set_object_location_ex
    File "T:\InGame\Gameplay\Scripts\Server\objects\client_object_mixin.py", line 1493, in set_parent
    File "T:\InGame\Gameplay\Scripts\Server\objects\client_object_mixin.py", line 351, in location
    File "T:\InGame\Gameplay\Scripts\Server\objects\client_object_mixin.py", line 408, in set_location_without_distribution
    File "T:\InGame\Gameplay\Scripts\Server\objects\part.py", line 586, in on_owner_location_changed
    File "T:\InGame\Gameplay\Scripts\Server\objects\part.py", line 148, in get_joint_transform
    KeyError: 'Unable to find joint b__subroot__3 on object_sitDecoBenchSO3x1_01:0x05a20795722909c9[4]'

    24bc4691ef5b8b9615b242673desyncea.maxis.sims4_64.15.pc2018-06-15 19:09:06Local.Unknown.Unknown.1.43.14.1020-1.200.000.339.Releasepart.py:1484bc4691ef5b8b9615b242673Exception in , args: (30970660235741901, 30970660454461852, {6E07A6C1CF8ACD,0,World}, Transform(Vector3(293.470154, 154.657486, 299.463409), Quaternion(0.000000, 0.803197, 0.000000, 0.595713)), 0, (0, 0), 0), kwargs: {}
    KeyError('Unable to find joint b__subroot__3 on object_sitDecoBenchSO3x1_01:0x006e07a6ced8f19c[4]',) (KeyError: 'Unable to find joint b__subroot__3 on object_sitDecoBenchSO3x1_01:0x006e07a6ced8f19c[4]')
    Traceback (most recent call last):
    File "T:\InGame\Gameplay\Scripts\Core\sims4\utils.py", line 200, in wrapper
    File "T:\InGame\Gameplay\Scripts\Server\objects\part.py", line 146, in get_joint_transform
    File "T:\InGame\Gameplay\Scripts\Core\native\animation\__init__.py", line 239, in get_joint_transform_from_rig
    KeyError: 'get_joint_transform_from_rig: Joint name [b__subroot__3] was not found in the specified rig [c2c579b61b938d2a.8eaf13de]. JointNameHash [0]().'

    During handling of the above exception, another exception occurred:

    Traceback (most recent call last):
    File "T:\InGame\Gameplay\Scripts\Core\sims4\utils.py", line 196, in wrapper
    File "T:\InGame\Gameplay\Scripts\Server\build_buy.py", line 804, in c_api_set_object_location_ex
    File "T:\InGame\Gameplay\Scripts\Server\objects\client_object_mixin.py", line 1493, in set_parent
    File "T:\InGame\Gameplay\Scripts\Server\objects\client_object_mixin.py", line 351, in location
    File "T:\InGame\Gameplay\Scripts\Server\objects\client_object_mixin.py", line 408, in set_location_without_distribution
    File "T:\InGame\Gameplay\Scripts\Server\objects\part.py", line 586, in on_owner_location_changed
    File "T:\InGame\Gameplay\Scripts\Server\objects\part.py", line 148, in get_joint_transform
    KeyError: 'Unable to find joint b__subroot__3 on object_sitDecoBenchSO3x1_01:0x006e07a6ced8f19c[4]'

    24bc4691ef5b8b9615b242673desyncea.maxis.sims4_64.15.pc2018-06-15 19:09:08Local.Unknown.Unknown.1.43.14.1020-1.200.000.339.Releasepart.py:1484bc4691ef5b8b9615b242673Exception in , args: (30970660454461852, Transform(Vector3(293.470123, 154.657486, 299.463409), Quaternion(0.000000, -0.803198, 0.000000, -0.595713)), 30970660235741901, {6E07A6C1CF8ACD,0,World}), kwargs: {}
    KeyError('Unable to find joint b__subroot__3 on object_sitDecoBenchSO3x1_01:0x006e07a6ced8f19c[4]',) (KeyError: 'Unable to find joint b__subroot__3 on object_sitDecoBenchSO3x1_01:0x006e07a6ced8f19c[4]')
    Traceback (most recent call last):
    File "T:\InGame\Gameplay\Scripts\Core\sims4\utils.py", line 200, in wrapper
    File "T:\InGame\Gameplay\Scripts\Server\objects\part.py", line 146, in get_joint_transform
    File "T:\InGame\Gameplay\Scripts\Core\native\animation\__init__.py", line 239, in get_joint_transform_from_rig
    KeyError: 'get_joint_transform_from_rig: Joint name [b__subroot__3] was not found in the specified rig [c2c579b61b938d2a.8eaf13de]. JointNameHash [0]().'

    During handling of the above exception, another exception occurred:

    Traceback (most recent call last):
    File "T:\InGame\Gameplay\Scripts\Core\sims4\utils.py", line 196, in wrapper
    File "T:\InGame\Gameplay\Scripts\Server\objects\system.py", line 402, in c_api_clear_parent_object
    File "T:\InGame\Gameplay\Scripts\Server\objects\client_object_mixin.py", line 1500, in clear_parent
    File "T:\InGame\Gameplay\Scripts\Server\objects\client_object_mixin.py", line 1493, in set_parent
    File "T:\InGame\Gameplay\Scripts\Server\objects\client_object_mixin.py", line 351, in location
    File "T:\InGame\Gameplay\Scripts\Server\objects\client_object_mixin.py", line 408, in set_location_without_distribution
    File "T:\InGame\Gameplay\Scripts\Server\objects\part.py", line 586, in on_owner_location_changed
    File "T:\InGame\Gameplay\Scripts\Server\objects\part.py", line 148, in get_joint_transform
    KeyError: 'Unable to find joint b__subroot__3 on object_sitDecoBenchSO3x1_01:0x006e07a6ced8f19c[4]'

    24bc4691ef5b8b9615b242673desyncea.maxis.sims4_64.15.pc2018-06-15 21:50:01Local.Unknown.Unknown.1.43.14.1020-1.200.000.339.Releaserestaurant_zone_director.py:4044bc4691ef5b8b9615b242673Exception raised while processing zone spin up sequence: 'NoneType' object is not iterable (TypeError: 'NoneType' object is not iterable)
    Traceback (most recent call last):
    File "T:\InGame\Gameplay\Scripts\Server\areaserver.py", line 111, in wrapped
    File "T:\InGame\Gameplay\Scripts\Server\areaserver.py", line 107, in finally_wrap
    File "T:\InGame\Gameplay\Scripts\Core\sims4\utils.py", line 174, in wrapper
    File "T:\InGame\Gameplay\Scripts\Core\sims4\utils.py", line 192, in wrapper
    File "T:\InGame\Gameplay\Scripts\Server\areaserver.py", line 347, in c_api_client_connect
    File "T:\InGame\Gameplay\Scripts\Server\zone.py", line 536, in do_zone_spin_up
    File "T:\InGame\Gameplay\Scripts\Server\zone_spin_up_service.py", line 1178, in update
    File "T:\InGame\Gameplay\Scripts\Server\zone_spin_up_service.py", line 290, in on_enter
    File "T:\InGame\Gameplay\Scripts\Server\venues\venue_service.py", line 205, in _select_zone_director
    File "T:\InGame\Gameplay\Scripts\Server\venues\venue_service.py", line 321, in _set_zone_director
    File "T:\InGame\Gameplay\Scripts\Server\restaurants\restaurant_zone_director.py", line 230, in on_startup
    File "T:\InGame\Gameplay\Scripts\Server\restaurants\restaurant_zone_director.py", line 404, in _update_dining_spots
    TypeError: 'NoneType' object is not iterable

    24bc4691ef5b8b9615b242673desyncea.maxis.sims4_64.15.pc2018-06-15 21:55:47Local.Unknown.Unknown.1.43.14.1020-1.200.000.339.Releaserestaurant_zone_director.py:4044bc4691ef5b8b9615b242673Exception raised while processing zone spin up sequence: 'NoneType' object is not iterable (TypeError: 'NoneType' object is not iterable)
    Traceback (most recent call last):
    File "T:\InGame\Gameplay\Scripts\Server\areaserver.py", line 111, in wrapped
    File "T:\InGame\Gameplay\Scripts\Server\areaserver.py", line 107, in finally_wrap
    File "T:\InGame\Gameplay\Scripts\Core\sims4\utils.py", line 174, in wrapper
    File "T:\InGame\Gameplay\Scripts\Core\sims4\utils.py", line 192, in wrapper
    File "T:\InGame\Gameplay\Scripts\Server\areaserver.py", line 347, in c_api_client_connect
    File "T:\InGame\Gameplay\Scripts\Server\zone.py", line 536, in do_zone_spin_up
    File "T:\InGame\Gameplay\Scripts\Server\zone_spin_up_service.py", line 1178, in update
    File "T:\InGame\Gameplay\Scripts\Server\zone_spin_up_service.py", line 290, in on_enter
    File "T:\InGame\Gameplay\Scripts\Server\venues\venue_service.py", line 205, in _select_zone_director
    File "T:\InGame\Gameplay\Scripts\Server\venues\venue_service.py", line 321, in _set_zone_director
    File "T:\InGame\Gameplay\Scripts\Server\restaurants\restaurant_zone_director.py", line 230, in on_startup
    File "T:\InGame\Gameplay\Scripts\Server\restaurants\restaurant_zone_director.py", line 404, in _update_dining_spots
    TypeError: 'NoneType' object is not iterable
  • LittleSimTuberLittleSimTuber Posts: 26 New Member
    and i can't play
  • rosemowrosemow Posts: 142,038 Member
    edited June 2018
    Hello @LittleSimTuber
    If you have cc/mods in your game, move your whole mods folder to the desktop. Then start the game and test to see if the issues are still there. If it has helped with the issues, put your mods/ CC back into the newly generated mods folder that is in the sims 4 folder one by one or in batches and testing after each one to see which is the causes of the problem. Put one item or batch in , test the game , take it out. Then test another one, to find the cause of the issue

    If you use the “ More CAS Columns'' or “UI Cheats Extension”mods, make sure that you have the latest versions of them as previous versions are broken.
  • LittleSimTuberLittleSimTuber Posts: 26 New Member
    so you can't really tell me specifically what's wrong in my last exception file?
  • Bananas_45Bananas_45 Posts: 4,538 Member
    so you can't really tell me specifically what's wrong in my last exception file?

    If you have restaurant or food mods you could start there by making sure they are up to date, otherwise. I would suggest taking @rosemow's advice. You are also welcome to take your last exception to the general support section of the MCCC discord if you don't find an answer here. https://discordapp.com/invite/AUJ8RAa
  • pooookie99pooookie99 Posts: 1 New Member
    I just updated my game and now none of my households load. This is the file i got can you help me see whats wrong?





    <?xml version="1.0" ?>
    2f6599018aff674a35b294756desyncea.maxis.sims4.15.mac2018-06-19 13:12:04Local.Unknown.Unknown.1.44.77.1220-1.200.000.347.Releaseutils.py:116f6599018aff674a35b294756 Failure: 'ItsmeTroi_YouTuberCareer.ts4script' (ItsmeTroi_YouTuberCareer.ts4script) (ImportError: No module named 'ItsmeTroi_YouTuberCareer')
    Traceback (most recent call last):
    File "T:\InGame\Gameplay\Scripts\Core\sims4\importer\utils.py", line 119, in import_modules_by_path
    File "T:\InGame\Gameplay\Scripts\Core\sims4\importer\utils.py", line 116, in import_modules_by_path
    ImportError: No module named 'ItsmeTroi_YouTuberCareer'

    2f6599018aff674a35b294756desyncea.maxis.sims4.15.mac2018-06-19 13:12:04Local.Unknown.Unknown.1.44.77.1220-1.200.000.347.Releasemc_utils.py:124f6599018aff674a35b294756 Failure: 'mc_injections' (mc_injections) (AttributeError: type object 'DeathTracker' has no attribute 'handle_adultless_household')
    Traceback (most recent call last):
    File "T:\InGame\Gameplay\Scripts\Core\sims4\importer\utils.py", line 119, in import_modules_by_path
    File "T:\InGame\Gameplay\Scripts\Core\sims4\importer\utils.py", line 116, in import_modules_by_path
    File "", line 1566, in _find_and_load
    File "", line 1533, in _find_and_load_unlocked
    File "T:\InGame\Gameplay\Scripts\Core\sims4\importer\custom_import.py", line 72, in load_module
    File ".\mc_injections.py", line 151, in
    File ".\mc_injections.py", line 586, in CommandCenterInjections
    File ".\mc_utils.py", line 124, in _inject_to
    AttributeError: type object 'DeathTracker' has no attribute 'handle_adultless_household'

    2f6599018aff674a35b294756desyncea.maxis.sims4.15.mac2018-06-19 13:12:11Local.Unknown.Unknown.1.44.77.1220-1.200.000.347.Releasemc_injections.py:308f6599018aff674a35b294756[manus] Error during initialization of service tuning_instance_manager. This will likely cause additional errors in the future. (TypeError: 'NoneType' object is not callable)
    Traceback (most recent call last):
    File "T:\InGame\Gameplay\Scripts\Core\sims4\utils.py", line 179, in wrapper
    File "T:\InGame\Gameplay\Scripts\Server\areaserver.py", line 150, in c_api_server_init_tick
    File "T:\InGame\Gameplay\Scripts\Core\sims4\core_services.py", line 164, in start_service_tick
    File ".\mc_injections.py", line 247, in inject_load_data_into_class_instances
    AttributeError: 'NoneType' object has no attribute 'OBJECT'

    During handling of the above exception, another exception occurred:

    Traceback (most recent call last):
    File "T:\InGame\Gameplay\Scripts\Core\sims4\service_manager.py", line 335, in start_single_service
    File "T:\InGame\Gameplay\Scripts\Core\sims4\tuning\instance_manager.py", line 104, in update_incremental_start
    File "T:\InGame\Gameplay\Scripts\Core\sims4\tuning\instance_manager.py", line 144, in _execute_gen
    File "/Users/alexisdanerichard/Documents/Electronic Arts/The Sims 4/Mods/MTS_scumbumbo_1734079_PregnancyMegaMod_v5/MTS_Scumbumbo_PregnancyMegaMod_v5_Script.ts4script/injector.py", line 11, in _inject
    return new_function(target_function, *args, **kwargs)
    File "/Users/alexisdanerichard/Documents/Electronic Arts/The Sims 4/Mods/TS4_Road To Fame -MOD Beta V 0/TS4_Road To Fame -MOD- Beta v 0.3C.ts4script/TS4_RoadToFame'MOD''_Beta Mixer Interactions.py", line 17, in add_mixer_to_snippet
    original(self)
    File "/Users/alexisdanerichard/Documents/Electronic Arts/The Sims 4/Mods/MTS_scumbumbo_1734079_PregnancyMegaMod_v5/MTS_Scumbumbo_PregnancyMegaMod_v5_Script.ts4script/injector.py", line 11, in _inject
    return new_function(target_function, *args, **kwargs)
    File "/Users/alexisdanerichard/Documents/Electronic Arts/The Sims 4/Mods/TS4_Road To Fame -MOD Beta V 0/TS4_Road To Fame -MOD- Beta v 0.3C.ts4script/TS4_RoadToFame'MOD''_Beta Mixer Interactions -4.py", line 17, in add_mixer_to_snippet
    original(self)
    File "/Users/alexisdanerichard/Documents/Electronic Arts/The Sims 4/Mods/MTS_scumbumbo_1734079_PregnancyMegaMod_v5/MTS_Scumbumbo_PregnancyMegaMod_v5_Script.ts4script/injector.py", line 11, in _inject
    return new_function(target_function, *args, **kwargs)
    File "/Users/alexisdanerichard/Documents/Electronic Arts/The Sims 4/Mods/TS4_Road To Fame -MOD Beta V 0/TS4_Road To Fame -MOD- Beta v 0.3C.ts4script/TS4_RoadToFame'MOD''_Beta Mixer Interactions -3.py", line 17, in add_mixer_to_snippet
    original(self)
    File "/Users/alexisdanerichard/Documents/Electronic Arts/The Sims 4/Mods/MTS_scumbumbo_1734079_PregnancyMegaMod_v5/MTS_Scumbumbo_PregnancyMegaMod_v5_Script.ts4script/injector.py", line 11, in _inject
    return new_function(target_function, *args, **kwargs)
    File "/Users/alexisdanerichard/Documents/Electronic Arts/The Sims 4/Mods/TS4_Road To Fame -MOD Beta V 0/TS4_Road To Fame -MOD- Beta v 0.3C.ts4script/TS4_RoadToFame'MOD''_Beta Mixer Interactions -2.py", line 17, in add_mixer_to_snippet
    original(self)
    File "/Users/alexisdanerichard/Documents/Electronic Arts/The Sims 4/Mods/MTS_scumbumbo_1734079_PregnancyMegaMod_v5/MTS_Scumbumbo_PregnancyMegaMod_v5_Script.ts4script/injector.py", line 11, in _inject
    return new_function(target_function, *args, **kwargs)
    File "/Users/alexisdanerichard/Documents/Electronic Arts/The Sims 4/Mods/TS4_Road To Fame -MOD Beta V 0/TS4_Road To Fame -MOD- Beta v 0.3C.ts4script/TS4_RoadToFame'MOD'' Death Flower Interactions.py", line 12, in add_superaffordances
    original(self)
    File ".\mc_utils.py", line 114, in _wrapper_function
    File ".\mc_injections.py", line 308, in inject_load_data_into_class_instances
    TypeError: 'NoneType' object is not callable
  • LuvMySimzLuvMySimz Posts: 374 Member
    edited June 2018
    Some of your mods broke due to the newest patch which is most likely always an issue after a new patch update.
    Take out your mods and wait for the updates by the modders. Check on the pages where you downloaded your mods in the upcoming days. I'm sure the modders will update their mods soon.
    ~ Never judge someone based on the opinion of others ~

    hphwr5fiois.png


  • Bananas_45Bananas_45 Posts: 4,538 Member
    @pooookie99 Several Mods have broken due to the patch including the following listed in your Last Exception:
    Road to Fame
    Scumbumbo Mega Pregnancy Mod
    It's Me Troi YouTube Career

    Please check with the creators for updates.

    MCCC will also need updating.

    For more information on Mods Broken by the patch please see this thread:
    https://forums.thesims.com/en_US/discussion/941998/broken-updated-mods-seasons-june-2018-patch#latest
  • jimnsjimns Posts: 2 New Member
    Hi. Does anyone know what's wrong with my last exception file?

    <?xml version="1.0"?>
    2d3b8c02d846e88f25b2b2318desyncea.maxis.sims4_64.15.pc2018-06-21 14:20:17Local.Unknown.Unknown.1.41.42.1020-1.200.000.311.Releasesim_info.py:1071d3b8c02d846e88f25b2b2318
    Exception in Sim Timeline: Exception running Element (AttributeError: 'NoneType' object has no attribute 'remove_statistic')

    Traceback (most recent call last):

    File "T:\InGame\Gameplay\Scripts\Server\scheduling.py", line 212, in simulate

    File "T:\InGame\Gameplay\Scripts\Server\alarms.py", line 260, in _run

    File "T:\InGame\Gameplay\Scripts\Server\statistics\continuous_statistic.py", line 719, in _alarm_callback

    File "T:\InGame\Gameplay\Scripts\Server\statistics\continuous_statistic.py", line 740, in _trigger_callback

    File "T:\InGame\Gameplay\Scripts\Server\statistics\base_statistic_listener.py", line 53, in trigger_callback

    File "T:\InGame\Gameplay\Scripts\Server\sims\culling\culling_service.py", line 155, in _on_culling_ghost_commodity_min

    File "T:\InGame\Gameplay\Scripts\Server\sims\sim_info.py", line 1071, in remove_statistic

    AttributeError: 'NoneType' object has no attribute 'remove_statistic'
  • Bananas_45Bananas_45 Posts: 4,538 Member
    @jimns did you updates MCCC yesterday to 4.4.3?
  • jimnsjimns Posts: 2 New Member
    > @Bananas_45 said:
    > @jimns did you updates MCCC yesterday to 4.4.3?

    Nope, I haven't update it because I haven't got Season yet.
  • Bananas_45Bananas_45 Posts: 4,538 Member
    jimns wrote: »
    > @Bananas_45 said:
    > @jimns did you updates MCCC yesterday to 4.4.3?

    Nope, I haven't update it because I haven't got Season yet.

    I suggest you post your last exception to the general support section of MCCC discord. Be sure to tell them that you have not updated your game for the Seasons patch and also have not updated MCCC.
    https://discordapp.com/invite/AUJ8RAa
  • rdorka347rdorka347 Posts: 2 New Member
    Hi! Can you help me with this? I just bought the game few days ago (no mods, no cc)


    <?xml version="1.0" ?>
    21be788b862b563f55b2b4351desyncea.maxis.sims4_64.15.pc2018-06-21 10:09:03Local.Unknown.Unknown.1.44.77.1020-1.200.000.347.Releaseasm.py:9951be788b862b563f55b2b4351Exception in Sim Timeline: Exception resuming Element (RuntimeError: ASM :: Carry_GenericObject (HANDLE :: 69426)>: Attempt to traverse between two states (entry -> Carry) where no valid path exists! Actors {'carryObject': (, None, ), 'x': (, None, ), 'surface': (, '1', None)})
    Traceback (most recent call last):
    File "T:\InGame\Gameplay\Scripts\Server\scheduling.py", line 217, in simulate
    File "T:\InGame\Gameplay\Scripts\Server\elements.py", line 385, in _resume
    File "T:\InGame\Gameplay\Scripts\Server\postures\transition.py", line 578, in _run_gen
    File "T:\InGame\Gameplay\Scripts\Server\postures\transition.py", line 477, in _do_transition
    File "T:\InGame\Gameplay\Scripts\Server\postures\transition.py", line 308, in start_posture_idle
    File "T:\InGame\Gameplay\Scripts\Server\postures\posture.py", line 2084, in append_idle_to_arb
    File "T:\InGame\Gameplay\Scripts\Server\animation\asm.py", line 995, in request
    RuntimeError: ASM :: Carry_GenericObject (HANDLE :: 69426)>: Attempt to traverse between two states (entry -> Carry) where no valid path exists! Actors {'carryObject': (, None, ), 'x': (, None, ), 'surface': (, '1', None)}

    21be788b862b563f55b2b4351desyncea.maxis.sims4_64.15.pc2018-06-21 12:36:43Local.Unknown.Unknown.1.44.77.1020-1.200.000.347.Releaselog.py:8361be788b862b563f55b2b4351[tingyul] Exception thrown while loading an object in an inventory.
    Object: object_Toddler_tablet:0x02e807acbbcc2b4c Owner: (AssertionError: [Object Manager] [tingyul] Attempting to move an object object_Toddler_tablet:0x02e807acbbcc2b4c that is not in this manager or not the same object object_Toddler_tablet:0x02e807acbbcc2b4c in manager)
    Traceback (most recent call last):
    File "T:\InGame\Gameplay\Scripts\Server\areaserver.py", line 113, in wrapped
    File "T:\InGame\Gameplay\Scripts\Server\areaserver.py", line 109, in finally_wrap
    File "T:\InGame\Gameplay\Scripts\Core\sims4\utils.py", line 157, in wrapper
    File "T:\InGame\Gameplay\Scripts\Core\sims4\utils.py", line 175, in wrapper
    File "T:\InGame\Gameplay\Scripts\Server\areaserver.py", line 356, in c_api_client_connect
    File "T:\InGame\Gameplay\Scripts\Server\zone.py", line 548, in do_zone_spin_up
    File "T:\InGame\Gameplay\Scripts\Server\zone_spin_up_service.py", line 1249, in update
    File "T:\InGame\Gameplay\Scripts\Server\zone_spin_up_service.py", line 579, in on_enter
    File "T:\InGame\Gameplay\Scripts\Server\sims\sim_spawner_service.py", line 639, in batch_spawn_during_zone_spin_up
    File "T:\InGame\Gameplay\Scripts\Server\sims\sim_spawner_service.py", line 808, in _spawn_next_sim
    File "T:\InGame\Gameplay\Scripts\Server\sims\sim_spawner_service.py", line 841, in _spawn_requested_sim
    File "T:\InGame\Gameplay\Scripts\Server\sims\sim_spawner.py", line 425, in spawn_sim
    File "T:\InGame\Gameplay\Scripts\Server\sims\sim_info.py", line 1661, in create_sim_instance
    File "T:\InGame\Gameplay\Scripts\Server\objects\system.py", line 183, in create_object
    File "T:\InGame\Gameplay\Scripts\Server\objects\object_manager.py", line 487, in add
    File "T:\InGame\Gameplay\Scripts\Server\indexed_manager.py", line 164, in add
    File "T:\InGame\Gameplay\Scripts\Server\objects\object_manager.py", line 84, in call_on_add
    File "T:\InGame\Gameplay\Scripts\Server\indexed_manager.py", line 279, in call_on_add
    File "T:\InGame\Gameplay\Scripts\Server\sims\sim.py", line 2364, in on_add
    File "T:\InGame\Gameplay\Scripts\Server\objects\components\inventory.py", line 681, in load_items
    File "T:\InGame\Gameplay\Scripts\Server\objects\components\sim_inventory_component.py", line 117, in _load_item
    File "T:\InGame\Gameplay\Scripts\Server\objects\components\inventory.py", line 691, in _create_inventory_object
    File "T:\InGame\Gameplay\Scripts\Server\objects\system.py", line 191, in create_object
    File "T:\InGame\Gameplay\Scripts\Server\objects\components\inventory.py", line 691, in
    File "T:\InGame\Gameplay\Scripts\Server\objects\components\inventory.py", line 709, in _post_create_object
    File "T:\InGame\Gameplay\Scripts\Server\objects\components\inventory.py", line 323, in add_from_load
    File "T:\InGame\Gameplay\Scripts\Server\objects\components\inventory.py", line 339, in _insert_item
    File "T:\InGame\Gameplay\Scripts\Server\objects\components\inventory_storage.py", line 170, in insert
    File "T:\InGame\Gameplay\Scripts\Server\objects\components\inventory_storage.py", line 273, in _insert
    File "T:\InGame\Gameplay\Scripts\Server\objects\object_manager.py", line 479, in move_to_inventory
    File "T:\InGame\Gameplay\Scripts\Core\sims4\log.py", line 836, in assert_raise
    AssertionError: [Object Manager] [tingyul] Attempting to move an object object_Toddler_tablet:0x02e807acbbcc2b4c that is not in this manager or not the same object object_Toddler_tablet:0x02e807acbbcc2b4c in manager
  • Bananas_45Bananas_45 Posts: 4,538 Member
    edited June 2018
    @rdorka347 if you don't have any CC or Mods it's most likely a game glitch. Try deleting your cache, caschestr, and localthumbcache.package files. That will clear out any bloated data and next time you play your game it will regenerate those files. You can also safely delete the last exception file.
Sign In or Register to comment.
Return to top